BDBM50443568 CHEMBL3091929
SMILES CCn1c(=O)c(sc1=Cc1cccc[n+]1CCCCCCNC(=O)CCCC[C@@H]1SC[C@@H]2NC(=O)N[C@H]12)=C1Sc2ccc(cc2N1C)C(C)(F)F
InChI Key InChIKey=GFTVZVWITGILBW-OBWKWBNQSA-O
Data  1 Kd
  Tab Delimited (TSV)   2D SDfile   Computed 3D by Vconf -m prep SDfile
Find this compound or compounds like it in BindingDB:
Activity Spreadsheet -- Enzyme Inhibition Constant Data from BindingDB
Found 1 hit for monomerid = 50443568
TargetHeat shock cognate 71 kDa protein(Homo sapiens (Human))
University Of California San Francisco
Curated by ChEMBL
LigandPNGBDBM50443568(CHEMBL3091929)
Affinity DataKd:  400nM. Assay description: Binding affinity to human HSC70 after 3 hrs by ELISA
In DepthDetails ArticlePubMed