BDBM50443578 CHEMBL3091941
SMILES CCn1c(=Cc2cccc[n+]2CCCCCCNC(=O)CCCC[C@@H]2SC[C@@H]3NC(=O)N[C@H]23)sc(=C2Sc3ccccc3N2C)c1=O
InChI Key InChIKey=YYCYUDLTWYNBMN-HOMRVSDPSA-O
Data  1 Kd
  Tab Delimited (TSV)   2D SDfile   Computed 3D by Vconf -m prep SDfile
Find this compound or compounds like it in BindingDB:
Activity Spreadsheet -- Enzyme Inhibition Constant Data from BindingDB
Found 1 hit for monomerid = 50443578
TargetHeat shock cognate 71 kDa protein(Homo sapiens (Human))
University Of California San Francisco
Curated by ChEMBL
LigandPNGBDBM50443578(CHEMBL3091941)
Affinity DataKd:  2.00E+3nM. Assay description: Binding affinity to human HSC70 after 3 hrs by ELISA
In DepthDetails ArticlePubMed