BDBM50444392 CHEMBL3094487
SMILES CC[C@@H](Cc1ccc(O)cc1C)NS(=O)(=O)c1c(C)cc(C)cc1C
InChI Key InChIKey=KIXSJEJHLVMNMZ-SFHVURJKSA-N
Data  4 IC50
  Tab Delimited (TSV)   2D SDfile   Computed 3D by Vconf -m prep SDfile
Find this compound or compounds like it in BindingDB:
Activity Spreadsheet -- Enzyme Inhibition Constant Data from BindingDB
Found 4 hits for monomerid = 50444392
TargetGlucocorticoid receptor(Homo sapiens (Human))
Boehringer Ingelheim Pharmaceuticals
Curated by ChEMBL
LigandPNGBDBM50444392(CHEMBL3094487)
Affinity DataIC50:  27nM. Assay description: Inhibition of glucocorticoid receptor (unknown origin) expressed in baculovirus-infected insect cells by fluorescence polarization assay
In DepthDetails ArticlePubMed
TargetProgesterone receptor(Homo sapiens (Human))
Boehringer Ingelheim Pharmaceuticals
Curated by ChEMBL
LigandPNGBDBM50444392(CHEMBL3094487)
Affinity DataIC50:  2.80E+3nM. Assay description: Inhibition of progesterone receptor (unknown origin) expressed in baculovirus-infected insect cells by fluorescence polarization assay
In DepthDetails ArticlePubMed
TargetMineralocorticoid receptor(Homo sapiens (Human))
Boehringer Ingelheim Pharmaceuticals
Curated by ChEMBL
LigandPNGBDBM50444392(CHEMBL3094487)
Affinity DataIC50:  1.00E+3nM. Assay description: Inhibition of mineralocorticoid receptor (unknown origin) expressed in baculovirus-infected insect cells by fluorescence polarization assay
In DepthDetails ArticlePubMed
TargetGlucocorticoid receptor(Homo sapiens (Human))
Boehringer Ingelheim Pharmaceuticals
Curated by ChEMBL
LigandPNGBDBM50444392(CHEMBL3094487)
Affinity DataIC50: >2.00E+3nM. Assay description: Agonist activity at glucocorticoid receptor in human foreskin fibroblasts assessed as IL-1-mediated IL-6 synthesis after 24 hrs
In DepthDetails ArticlePubMed