BDBM50444584 CHEMBL3099718::US9340549, 95
SMILES CC1(C)OC(=O)N([C@H]1c1ccccc1)[C@H]1CC[C@@H](CC1)c1cnc(N)c(c1)C#N
InChI Key InChIKey=SOHHQHWGZGODEC-YSSFQJQWSA-N
Data  3 IC50
  Tab Delimited (TSV)   2D SDfile   Computed 3D by Vconf -m prep SDfile
Find this compound or compounds like it in BindingDB:
Activity Spreadsheet -- Enzyme Inhibition Constant Data from BindingDB
Found 2 hits for monomerid = 50444584
TargetPoly [ADP-ribose] polymerase 1(Homo sapiens (Human))
Amgen
Curated by ChEMBL
LigandPNGBDBM50444584(CHEMBL3099718 | US9340549, 95)
Affinity DataIC50: >8.50E+4nM. Assay description: Inhibition of PARP1 (unknown origin)
In DepthDetails ArticlePubMed
TargetPoly [ADP-ribose] polymerase 2(Homo sapiens (Human))
Amgen
Curated by ChEMBL
LigandPNGBDBM50444584(CHEMBL3099718 | US9340549, 95)
Affinity DataIC50: >1.70E+5nM. Assay description: Inhibition of PARP2 (unknown origin)
In DepthDetails ArticlePubMed