BDBM50445059 CHEMBL3098858
SMILES C[C@H]1CC\C(=C/C(/C)=C\C=C\C(\C)=C\C(O)=O)c2ccccc12
InChI Key InChIKey=IUAWGSHMQSZQSY-KWACTLEVSA-N
Data  1 EC50
  Tab Delimited (TSV)   2D SDfile   Computed 3D by Vconf -m prep SDfile
Find this compound or compounds like it in BindingDB:
Activity Spreadsheet -- Enzyme Inhibition Constant Data from BindingDB
Found 1 hit for monomerid = 50445059
TargetRetinoic acid receptor RXR-alpha(RAT)
University Of Alabama At Birmingham
Curated by ChEMBL
LigandPNGBDBM50445059(CHEMBL3098858)
Affinity DataEC50:  120nM. Assay description: Agonist activity at RXRalpha in rat RK3E cells assessed as transcriptional activation by luciferase reporter gene assay
In DepthDetails ArticlePubMed