BDBM50445495 CHEMBL3104892
SMILES CCN1C(=O)c2cc(C)nc(Oc3cccc(NS(=O)(=O)c4ccc(Cl)cc4)c3)c2C1=O
InChI Key InChIKey=DTOXZAUVNHRCQB-UHFFFAOYSA-N
Data  1 EC50
  Tab Delimited (TSV)   2D SDfile   Computed 3D by Vconf -m prep SDfile
Find this compound or compounds like it in BindingDB:
Activity Spreadsheet -- Enzyme Inhibition Constant Data from BindingDB
Found 1 hit for monomerid = 50445495
TargetGlucose-dependent insulinotropic receptor(Homo sapiens (Human))
Amgen
Curated by ChEMBL
LigandPNGBDBM50445495(CHEMBL3104892)
Affinity DataEC50:  11nM. Assay description: Agonist activity at human GPR119 expressed in HEK293 cells assessed as cAMP accumulation after 30 mins
In DepthDetails ArticlePubMed