BDBM50448221 CHEMBL3120828
SMILES CC(C)(CC(=O)N[C@H]1C2CC3CC1C[C@](C3)(C2)C(N)=O)NS(=O)(=O)c1ccc(F)cc1
InChI Key InChIKey=NITFULNJHLDIPX-TXBRZDKCSA-N
Data  2 IC50
  Tab Delimited (TSV)   2D SDfile   Computed 3D by Vconf -m prep SDfile
Find this compound or compounds like it in BindingDB:
Activity Spreadsheet -- Enzyme Inhibition Constant Data from BindingDB
Found 2 hits for monomerid = 50448221
Target11-beta-hydroxysteroid dehydrogenase 1(Homo sapiens (Human))
Yonsei University
Curated by ChEMBL
LigandPNGBDBM50448221(CHEMBL3120828)
Affinity DataIC50:  1nM. Assay description: Inhibition of 11beta-HSD1 in human liver microsomes using cortisone as substrate after 2 hrs by HTRF assay
In DepthDetails ArticlePubMed
Target11-beta-hydroxysteroid dehydrogenase 1(Mus musculus (mouse))
Yonsei University
Curated by ChEMBL
LigandPNGBDBM50448221(CHEMBL3120828)
Affinity DataIC50:  24nM. Assay description: Inhibition of 11beta-HSD1 in mouse liver microsomes using cortisone as substrate after 2 hrs by HTRF assay
In DepthDetails ArticlePubMed