BDBM50448909 CHEMBL3125299
SMILES O=Cc1ccc(nc1)-c1cnc(o1)C(=O)CCCCCCc1ccccc1
InChI Key InChIKey=ZOFUFXSNZFJVKN-UHFFFAOYSA-N
Data  2 KI
  Tab Delimited (TSV)   2D SDfile   Computed 3D by Vconf -m prep SDfile
Find this compound or compounds like it in BindingDB:
Activity Spreadsheet -- Enzyme Inhibition Constant Data from BindingDB
Found 2 hits for monomerid = 50448909
TargetFatty-acid amide hydrolase 1 [30-579](Rattus norvegicus (rat))
The Scripps Research Institute
Curated by ChEMBL
LigandPNGBDBM50448909(CHEMBL3125299)
Affinity DataKi:  2nM. Assay description: Time-dependent inhibition of recombinant rat FAAH expressed in Escherichia coli assessed as breakdown of [14C]-oleamide preincubated for 3 hrs by Dix...
In DepthDetails ArticlePubMed
TargetFatty-acid amide hydrolase 1 [30-579](Rattus norvegicus (rat))
The Scripps Research Institute
Curated by ChEMBL
LigandPNGBDBM50448909(CHEMBL3125299)
Affinity DataKi:  2.20nM. Assay description: Inhibition of recombinant rat FAAH expressed in Escherichia coli assessed as breakdown of [14C]-oleamide by Dixon plot analysis
In DepthDetails ArticlePubMed