BDBM50448916 CHEMBL3125308
SMILES OC(=O)Cc1ccc(nc1)-c1cnc(o1)C(=O)CCCCCCc1ccccc1
InChI Key InChIKey=PBCOYCJRICVFEE-UHFFFAOYSA-N
Data  1 KI
  Tab Delimited (TSV)   2D SDfile   Computed 3D by Vconf -m prep SDfile
Find this compound or compounds like it in BindingDB:
Activity Spreadsheet -- Enzyme Inhibition Constant Data from BindingDB
Found 1 hit for monomerid = 50448916
TargetFatty-acid amide hydrolase 1 [30-579](Rattus norvegicus (rat))
The Scripps Research Institute
Curated by ChEMBL
LigandPNGBDBM50448916(CHEMBL3125308)
Affinity DataKi:  4nM. Assay description: Inhibition of recombinant rat FAAH expressed in Escherichia coli assessed as breakdown of [14C]-oleamide by Dixon plot analysis
In DepthDetails ArticlePubMed