BDBM50450320 CHEMBL49001
SMILES CCCCCCCN(CCCCCSC1=NC(=O)C(N1)(c1ccccc1)c1ccccc1)C(=O)NC(C)C
InChI Key InChIKey=MRXFISSCLLVXGQ-UHFFFAOYSA-N
Data  2 IC50
  Tab Delimited (TSV)   2D SDfile   Computed 3D by Vconf -m prep SDfile
Find this compound or compounds like it in BindingDB:
Activity Spreadsheet -- Enzyme Inhibition Constant Data from BindingDB
Found 2 hits for monomerid = 50450320
TargetSterol O-acyltransferase 1(Mus musculus)
Dupont Pharmaceuticals
Curated by ChEMBL
LigandPNGBDBM50450320(CHEMBL49001)
Affinity DataIC50:  2.14E+3nM. Assay description: Inhibition of acyl coenzyme A:cholesterol acyltransferase (ACAT) in J774 Macrophage cell culture by using J774 assay.
In DepthDetails
TargetSterol O-acyltransferase 1(Rattus norvegicus)
Dupont Pharmaceuticals
Curated by ChEMBL
LigandPNGBDBM50450320(CHEMBL49001)
Affinity DataIC50:  2.79E+3nM. Assay description: In vitro inhibition of acyl coenzyme A:cholesterol acyltransferase (ACAT) in rat hepatic microsomes by using AIV assay.
In DepthDetails