BDBM50450327 CHEMBL300518
SMILES CCCCCCCN(CCCCCSc1[nH]cnc2nncc12)C(=O)Nc1ccc(F)cc1F
InChI Key InChIKey=XYWZYKFEWQUCRK-UHFFFAOYSA-N
Data  2 IC50
  Tab Delimited (TSV)   2D SDfile   Computed 3D by Vconf -m prep SDfile
Find this compound or compounds like it in BindingDB:
Activity Spreadsheet -- Enzyme Inhibition Constant Data from BindingDB
Found 2 hits for monomerid = 50450327
TargetSterol O-acyltransferase 1(Rattus norvegicus)
Dupont Pharmaceuticals
Curated by ChEMBL
LigandPNGBDBM50450327(CHEMBL300518)
Affinity DataIC50:  710nM. Assay description: In vitro inhibition of acyl coenzyme A:cholesterol acyltransferase (ACAT) in rat hepatic microsomes by using AIV assay.
In DepthDetails
TargetSterol O-acyltransferase 1(Mus musculus)
Dupont Pharmaceuticals
Curated by ChEMBL
LigandPNGBDBM50450327(CHEMBL300518)
Affinity DataIC50:  3.31E+3nM. Assay description: Inhibition of acyl coenzyme A:cholesterol acyltransferase (ACAT) in J774 Macrophage cell culture by using J774 assay.
In DepthDetails