BDBM50450330 CHEMBL295251
SMILES CCCCCCCN(CCCCCSc1nnc(-c2ccccc2)c(n1)-c1ccccc1)C(=O)Nc1ccc(F)cc1F
InChI Key InChIKey=HVSPDDMQOSPCCO-UHFFFAOYSA-N
Data  2 IC50
  Tab Delimited (TSV)   2D SDfile   Computed 3D by Vconf -m prep SDfile
Find this compound or compounds like it in BindingDB:
Activity Spreadsheet -- Enzyme Inhibition Constant Data from BindingDB
Found 2 hits for monomerid = 50450330
TargetSterol O-acyltransferase 1(Rattus norvegicus)
Dupont Pharmaceuticals
Curated by ChEMBL
LigandPNGBDBM50450330(CHEMBL295251)
Affinity DataIC50:  440nM. Assay description: In vitro inhibition of acyl coenzyme A:cholesterol acyltransferase (ACAT) in rat hepatic microsomes by using AIV assay.
In DepthDetails
TargetSterol O-acyltransferase 1(Mus musculus)
Dupont Pharmaceuticals
Curated by ChEMBL
LigandPNGBDBM50450330(CHEMBL295251)
Affinity DataIC50:  1.06E+4nM. Assay description: Inhibition of acyl coenzyme A:cholesterol acyltransferase (ACAT) in J774 Macrophage cell culture by using J774 assay.
In DepthDetails