BDBM50450603 CHEMBL4159473
SMILES CCCC[C@@H]1NC(=O)[C@H](Cc2c[nH]c3ccccc23)NC(=O)[C@H](CCCCN)NC(=O)[C@H](CCC(N)=O)NC(=O)[C@H](CSSC[C@@H]2NC(=O)[C@@H]3CSSC[C@H](NC(=O)[C@H](Cc4c[nH]c5ccccc45)NC(=O)[C@H](CC(C)C)NC(=O)[C@H](CCCCN)NC(=O)[C@H](CSSC[C@H](NC(=O)[C@@H](NC(=O)[C@H](Cc4c[nH]c5ccccc45)NC1=O)[C@@H](C)O)C(=O)N[C@@H](CC(O)=O)C(=O)N[C@@H](CO)C(=O)N[C@@H](CCCCN)C(=O)N[C@@H](CCCNC(N)=N)C(=O)N[C@@H](C)C(=O)N3)NC(=O)[C@H](CCCNC(N)=N)NC(=O)[C@H](CC(C)C)NC(=O)CNC(=O)[C@H](CCC(O)=O)NC2=O)C(=O)N[C@@H](CCCNC(N)=N)C(=O)N[C@@H](CCCCN)C(=O)N[C@@H](CCC(O)=O)C(=O)N[C@@H](CCc1ccccc1)C(N)=O)NC(=O)[C@H](Cc1ccc(O)cc1)NC(=O)[C@@H](N)CC#C
InChI Key InChIKey=AHWSGUQUIABDFY-RRIOGTMSSA-N
Data  2 IC50
  Tab Delimited (TSV)   2D SDfile   Computed 3D by Vconf -m prep SDfile
Find this compound or compounds like it in BindingDB:
Activity Spreadsheet -- Enzyme Inhibition Constant Data from BindingDB
Found 2 hits for monomerid = 50450603
TargetSodium channel protein type 4 subunit alpha(Homo sapiens (Human))
Amgen
Curated by ChEMBL
LigandPNGBDBM50450603(CHEMBL4159473)
Affinity DataIC50:  23nM. Assay description: Inhibition of human Nav1.4 expressed in HEK293 cells at holding potential of -125 mV after 10 mins by patchxpress-based electrophysiology assay
Ligand InfoPC cidPC sid
In DepthDetails ArticlePubMed
TargetSodium channel protein type 9 subunit alpha(Homo sapiens (Human))
Amgen
Curated by ChEMBL
LigandPNGBDBM50450603(CHEMBL4159473)
Affinity DataIC50:  0.300nM. Assay description: Inhibition of human Nav1.7 expressed in HEK293 cells at holding potential of -125 mV after 10 mins by patchxpress-based electrophysiology assay
Ligand InfoPC cidPC sid
In DepthDetails ArticlePubMed