BDBM50450866 CHEMBL4208829
SMILES COc1nn(C)cc1Nc1nc(nc2n(cnc12)C(C)(C)C)N1C[C@@H](F)[C@@H](C1)NC(=O)C=C
InChI Key InChIKey=CPHKKAZXAJOGRP-CHWSQXEVSA-N
Data  1 KI  2 IC50
  Tab Delimited (TSV)   2D SDfile   Computed 3D by Vconf -m prep SDfile
Find this compound or compounds like it in BindingDB:
Activity Spreadsheet -- Enzyme Inhibition Constant Data from BindingDB
Found 3 hits for monomerid = 50450866
TargetEpidermal growth factor receptor(Homo sapiens (Human))
Wuxi Apptec
Curated by ChEMBL
LigandPNGBDBM50450866(CHEMBL4208829)
Affinity DataKi:  18nM. Assay description: Inhibition of EGFR T790M/L858R double mutant (unknown origin)
Ligand InfoPC cidPC sid
In DepthDetails ArticlePubMed
TargetEpidermal growth factor receptor(Homo sapiens (Human))
Wuxi Apptec
Curated by ChEMBL
LigandPNGBDBM50450866(CHEMBL4208829)
Affinity DataIC50:  673nM. Assay description: Inhibition of EGF-stimulated wild-type EGFR phosphorylation in human A549 cells preincubated for 2 hrs followed by EGF stimulation for 10 mins by san...
Ligand InfoPC cidPC sid
In DepthDetails ArticlePubMed
TargetEpidermal growth factor receptor(Homo sapiens (Human))
Wuxi Apptec
Curated by ChEMBL
LigandPNGBDBM50450866(CHEMBL4208829)
Affinity DataIC50:  17nM. Assay description: Inhibition of EGFR T790M/L858R double mutant phosphorylation in human H1975 cells preincubated for 2 hrs followed by EGF stimulation for 10 mins by s...
Ligand InfoPC cidPC sid
In DepthDetails ArticlePubMed