BDBM50451622 CHEMBL4218185
SMILES O=CCNC(=O)[C@H](Cc1ccccc1)NC(=O)OCc1ccccc1
InChI Key InChIKey=HGCGAOORAMFLTO-KRWDZBQOSA-N
Data  1 KI  2 IC50
  Tab Delimited (TSV)   2D SDfile   Computed 3D by Vconf -m prep SDfile
Find this compound or compounds like it in BindingDB:
Activity Spreadsheet -- Enzyme Inhibition Constant Data from BindingDB
Found 3 hits for monomerid = 50451622
TargetCruzipain(Trypanosoma cruzi)
Universidade De S£O Paulo
Curated by ChEMBL
LigandPNGBDBM50451622(CHEMBL4218185)
Affinity DataKi:  7.90nM. Assay description: Inhibition of recombinant Trypanosoma cruzi cruzain using Z-phe-Arg-7-amido-4-methylcoumarin as substrate by fluorometric method
Ligand InfoPC cidPC sid
In DepthDetails ArticlePubMed
TargetCysteine protease ATG4B(Homo sapiens (Human))
Roche Pharma Research And Early Development
Curated by ChEMBL
LigandPNGBDBM50451622(CHEMBL4218185)
Affinity DataIC50: >1.00E+5nM. Assay description: Inhibition of ATG4B (unknown origin) expressed in HEK293T cells coexpressing HTRA4 and Actin-LC3B-dNGLuc after 24 hrs by luciferase release assay
Ligand InfoPC cidPC sid
In DepthDetails ArticlePubMed
TargetCysteine protease ATG4B(Homo sapiens (Human))
Roche Pharma Research And Early Development
Curated by ChEMBL
LigandPNGBDBM50451622(CHEMBL4218185)
Affinity DataIC50: >1.00E+5nM. Assay description: Inhibition of ATG4B (unknown origin) using His-GATE-16-GST as substrate preincubated for 30 mins followed by substrate addition measured after 30 min...
Ligand InfoPC cidPC sid
In DepthDetails ArticlePubMed