BDBM50454610 CHEMBL2092769
SMILES NC(=O)c1csc(n1)[C@@H]1O[C@H](COP(O)(=O)OP(O)(=O)OC[C@@H]2O[C@@H]([C@@H](F)[C@H]2O)n2cnc3c(N)ncnc23)[C@@H](O)[C@H]1O
InChI Key InChIKey=YQKAZGQCCWSIOX-PYQYHBBISA-N
Data  1 IC50
  Tab Delimited (TSV)   2D SDfile   Computed 3D by Vconf -m prep SDfile
Find this compound or compounds like it in BindingDB:
Activity Spreadsheet -- Enzyme Inhibition Constant Data from BindingDB
Found 1 hit for monomerid = 50454610
TargetInosine-5'-monophosphate dehydrogenase 2(Homo sapiens (Human))
Codon Pharmaceuticals
Curated by ChEMBL
LigandPNGBDBM50454610(CHEMBL2092769)
Affinity DataIC50:  2.60E+3nM. Assay description: The compound was assayed to determine the inhibitory activity against human Inosine-5'-monophosphate dehydrogenase 2
In DepthDetails ArticlePubMed