BDBM50454846 CHEMBL4211201
SMILES [H][C@]1(NC(=O)[C@H](CO)NC(=O)[C@@H]2CCCN2C(=O)[C@H](Cc2ccc(O)cc2)NC(=O)CSC[C@H](NC(=O)[C@H](Cc2c[nH]c3ccccc23)NC(=O)[C@@]([H])(NC(=O)[C@H](Cc2c[nH]c3ccccc23)NC(=O)CNC(=O)[C@H](CO)NC(=O)[C@H](CCCNC(N)=N)NC(=O)[C@H](CCCCN)NC1=O)[C@@H](C)CC)C(N)=O)[C@@H](C)CC
InChI Key InChIKey=NQWWXDNNFGCNQQ-PUBCBCPYSA-N
Data  2 IC50  1 Kd
  Tab Delimited (TSV)   2D SDfile   Computed 3D by Vconf -m prep SDfile
Find this compound or compounds like it in BindingDB:
Activity Spreadsheet -- Enzyme Inhibition Constant Data from BindingDB
Found 3 hits for monomerid = 50454846
TargetLysine-specific demethylase 4A(Homo sapiens (Human))
The University Of Tokyo
Curated by ChEMBL
LigandPNGBDBM50454846(CHEMBL4211201)
Affinity DataKd:  21nM. Assay description: Binding affinity to biotinylated-KDM4A (unknown origin) at 300 nM by bio-layer interferometric method
Ligand InfoPC cidPC sid
In DepthDetails ArticlePubMed
TargetLysine-specific demethylase 4C(Homo sapiens (Human))
The University Of Tokyo
Curated by ChEMBL
LigandPNGBDBM50454846(CHEMBL4211201)
Affinity DataIC50:  55nM. Assay description: Inhibition of KDM4C (unknown origin) expressed in Escherichia coli using biotinylated peptide as substrate pretreated for 15 mins followed by substra...
Ligand InfoPC cidPC sid
In DepthDetails ArticlePubMed
TargetLysine-specific demethylase 4A(Homo sapiens (Human))
The University Of Tokyo
Curated by ChEMBL
LigandPNGBDBM50454846(CHEMBL4211201)
Affinity DataIC50:  41nM. Assay description: Inhibition of KDM4A (unknown origin) expressed in Escherichia coli using biotinylated peptide as substrate pretreated for 15 mins followed by substra...
Ligand InfoPC cidPC sid
In DepthDetails ArticlePubMed