BDBM50455466 CHEMBL4204681
SMILES COc1ccc(Cn2c(SCC(=O)Nc3nc4ccc(cc4s3)C(F)(F)F)nc3CCSc3c2=O)cc1
InChI Key InChIKey=OWANPHKGQQZYJY-UHFFFAOYSA-N
Data  5 IC50  1 EC50
  Tab Delimited (TSV)   2D SDfile   Computed 3D by Vconf -m prep SDfile
Find this compound or compounds like it in BindingDB:
Activity Spreadsheet -- Enzyme Inhibition Constant Data from BindingDB
Found 6 hits for monomerid = 50455466
TargetCasein kinase I isoform delta(Homo sapiens (Human))
Ulm University Hospital
Curated by ChEMBL
LigandPNGBDBM50455466(CHEMBL4204681)
Affinity DataEC50:  1.47E+3nM. Assay description: Inhibition of CK1delta in HEK293T cells assessed as stimulation of Wnt/beta-catenin signaling after 22 hrs in presence of Wnt3A-conditioned medium by...
Ligand InfoPC cidPC sid
In DepthDetails ArticlePubMed
TargetCasein kinase I isoform delta(Rattus norvegicus (rat))
Ulm University Hospital
Curated by ChEMBL
LigandPNGBDBM50455466(CHEMBL4204681)
Affinity DataIC50:  90nM. Assay description: Inhibition of rat recombinant CK1delta kinase domain using alpha-casein as substrate after 30 mins in presence of [gamma-32P]-ATP by Cherenkov counti...
Ligand InfoPC cidPC sid
In DepthDetails ArticlePubMed
TargetProtein-serine O-palmitoleoyltransferase porcupine(Homo sapiens (Human))
Ulm University Hospital
Curated by ChEMBL
LigandPNGBDBM50455466(CHEMBL4204681)
Affinity DataIC50:  710nM. Assay description: Inhibition of porcupine in HEK293T cells transfected with Wnt3A-expressing vector assessed as suppression of Wnt/beta-catenin signaling after 22 hrs ...
Ligand InfoPC cidPC sid
In DepthDetails ArticlePubMed
TargetCasein kinase I isoform delta(Rattus norvegicus (rat))
Ulm University Hospital
Curated by ChEMBL
LigandPNGBDBM50455466(CHEMBL4204681)
Affinity DataIC50:  90nM. Assay description: Inhibition of rat GST-tagged CK1delta M82F mutant at 10 uM using alpha-casein as substrate after 30 mins in presence of [gamma-32P]-ATP by Cherenkov ...
Ligand InfoPC cidPC sid
In DepthDetails ArticlePubMed
TargetCasein kinase I isoform epsilon(Homo sapiens (Human))
Ulm University Hospital
Curated by ChEMBL
LigandPNGBDBM50455466(CHEMBL4204681)
Affinity DataIC50:  560nM. Assay description: Inhibition of human recombinant CK1epsilon using alpha-casein as substrate after 30 mins in presence of [gamma-32P]-ATP by Cherenkov counting method
Ligand InfoPC cidPC sid
In DepthDetails ArticlePubMed
TargetCasein kinase I isoform delta(Rattus norvegicus (rat))
Ulm University Hospital
Curated by ChEMBL
LigandPNGBDBM50455466(CHEMBL4204681)
Affinity DataIC50:  410nM. Assay description: Inhibition of full-length rat GST-tagged CK1delta using alpha-casein as substrate after 30 mins in presence of [gamma-32P]-ATP by Cherenkov counting ...
Ligand InfoPC cidPC sid
In DepthDetails ArticlePubMed