BDBM50455607 2-(l-hexyn-l-yl)-adenosine-5'-N-methyluronamide (16a)::CHEMBL2113480
SMILES CCCCC#Cc1nc(N)c2ncn([C@@H]3O[C@@H]([C@@H](O)[C@H]3O)C(N)=O)c2n1
InChI Key InChIKey=XKJDQMIBXVCPBQ-MEQWQQMJSA-N
Data  2 KI
  Tab Delimited (TSV)   2D SDfile   Computed 3D by Vconf -m prep SDfile
Find this compound or compounds like it in BindingDB:
Activity Spreadsheet -- Enzyme Inhibition Constant Data from BindingDB
Found 2 hits for monomerid = 50455607
TargetAdenosine receptor A2a/A2b(Rattus norvegicus)
Hokkaido University
Curated by ChEMBL
LigandPNGBDBM50455607(2-(l-hexyn-l-yl)-adenosine-5'-N-methyluronamide (1...)
Affinity DataKi:  19nM. Assay description: Binding affinity against adenosine A2 receptor from rat striatum using [3H]NECA as radioligand.
In DepthDetails ArticlePubMed
TargetAdenosine receptor A1(Rattus norvegicus (rat))
Hokkaido University
Curated by ChEMBL
LigandPNGBDBM50455607(2-(l-hexyn-l-yl)-adenosine-5'-N-methyluronamide (1...)
Affinity DataKi:  1.27E+3nM. Assay description: Binding affinity against adenosine A1 receptor from rat brain membranes using [3H]cyclohexyladenosine as radioligand.
In DepthDetails ArticlePubMed