BDBM50456381 CHEMBL4209026
SMILES Nc1ncnc2n(nc(-c3cnc4[nH]c(=O)ccc4c3)c12)C1CCc2ccccc2C1
InChI Key InChIKey=KDLSNQPZPRWJMI-UHFFFAOYSA-N
Data  1 IC50
  Tab Delimited (TSV)   2D SDfile   Computed 3D by Vconf -m prep SDfile
Find this compound or compounds like it in BindingDB:
Activity Spreadsheet -- Enzyme Inhibition Constant Data from BindingDB
Found 1 hit for monomerid = 50456381
TargetSerine/threonine-protein kinase ATR(Homo sapiens (Human))
Integral Biosciences
Curated by ChEMBL
LigandPNGBDBM50456381(CHEMBL4209026)
Affinity DataIC50:  2.24E+4nM. Assay description: Inhibition of human recombinant FLAG-tagged full length ATR expressed in mammalian cell line co-expressing human recombinant cMyc-tagged full length ...
Ligand InfoPC cidPC sid
In DepthDetails ArticlePubMed