BDBM50457112 CHEMBL4205479
SMILES Clc1ccc(cc1)-c1ccc(OCCCCCN2CCN(C2=S)c2ccncc2)cc1
InChI Key InChIKey=ZOOMWNRJDACIOK-UHFFFAOYSA-N
Data  1 EC50
  Tab Delimited (TSV)   2D SDfile   Computed 3D by Vconf -m prep SDfile
Find this compound or compounds like it in BindingDB:
Activity Spreadsheet -- Enzyme Inhibition Constant Data from BindingDB
Found 1 hit for monomerid = 50457112
TargetGenome polyprotein(Human enterovirus 71 (strain BrCr) (Ev 71))
Wuxi Apptec (Shanghai)
Curated by ChEMBL
LigandPNGBDBM50457112(CHEMBL4205479)
Affinity DataEC50:  2.80E+3nM. Assay description: Inhibition of Enterovirus 71 Shenzhen/120F1/09 capsid infected in human RD cells assessed as reduction in virus-induced cell death after 72 hrs by CC...
Ligand InfoPC cidPC sid
In DepthDetails ArticlePubMed