BDBM50457115 CHEMBL4217122
SMILES CCO\N=C(/C)c1ccc(OCCCCCN2CCN(c3ccnc(N)c3)S2(=O)=O)cc1
InChI Key InChIKey=DEIXBFZTRBKFRL-XIEYBQDHSA-N
Data  1 EC50
  Tab Delimited (TSV)   2D SDfile   Computed 3D by Vconf -m prep SDfile
Find this compound or compounds like it in BindingDB:
Activity Spreadsheet -- Enzyme Inhibition Constant Data from BindingDB
Found 1 hit for monomerid = 50457115
TargetGenome polyprotein(Human enterovirus 71 (strain BrCr) (Ev 71))
Wuxi Apptec (Shanghai)
Curated by ChEMBL
LigandPNGBDBM50457115(CHEMBL4217122)
Affinity DataEC50:  600nM. Assay description: Inhibition of Enterovirus 71 Shenzhen/120F1/09 capsid infected in human RD cells assessed as reduction in virus-induced cell death after 72 hrs by CC...
Ligand InfoPC cidPC sid
In DepthDetails ArticlePubMed