BDBM50457121 CHEMBL4210399
SMILES CCO\N=C\c1ccc(OCCC(C)CCN2CCN(C2=O)c2ccnc(N)c2)cc1
InChI Key InChIKey=SRJKGDFZRYDLKM-YZSQISJMSA-N
Data  1 IC50  1 EC50
  Tab Delimited (TSV)   2D SDfile   Computed 3D by Vconf -m prep SDfile
Find this compound or compounds like it in BindingDB:
Activity Spreadsheet -- Enzyme Inhibition Constant Data from BindingDB
Found 2 hits for monomerid = 50457121
TargetPotassium voltage-gated channel subfamily H member 2(Homo sapiens (Human))
Wuxi Apptec (Shanghai)
Curated by ChEMBL
LigandPNGBDBM50457121(CHEMBL4210399)
Affinity DataIC50:  800nM. Assay description: Inhibition of human ERG expressed in CHO-K1 cells by Qpatch assay
Ligand InfoPC cidPC sid
In DepthDetails ArticlePubMed
TargetGenome polyprotein(Human enterovirus 71 (strain BrCr) (Ev 71))
Wuxi Apptec (Shanghai)
Curated by ChEMBL
LigandPNGBDBM50457121(CHEMBL4210399)
Affinity DataEC50:  0.0300nM. Assay description: Inhibition of Enterovirus 71 Shenzhen/120F1/09 capsid infected in human RD cells assessed as reduction in virus-induced cell death after 72 hrs by CC...
Ligand InfoPC cidPC sid
In DepthDetails ArticlePubMed