BDBM50459395 CHEMBL4210158
SMILES CN(C)C1CCCN(C(=O)c2ccc(cc2Cl)-n2ccc(C)n2)c2ccccc12
InChI Key InChIKey=VEFAAARTOXGZIC-UHFFFAOYSA-N
Data  3 KI
  Tab Delimited (TSV)   2D SDfile   Computed 3D by Vconf -m prep SDfile
Find this compound or compounds like it in BindingDB:
Activity Spreadsheet -- Enzyme Inhibition Constant Data from BindingDB
Found 3 hits for monomerid = 50459395
TargetVasopressin V1a receptor(Homo sapiens (Human))
Umr7200 Cnrs/Universit£
Curated by ChEMBL
LigandPNGBDBM50459395(CHEMBL4210158)
Affinity DataKi: <10nM. Assay description: Displacement of [3H]-AVP from human V1A receptor expressed in CHO cell membranes by radioligand binding assay
Ligand InfoPC cidPC sid
In DepthDetails ArticlePubMed
TargetVasopressin V2 receptor(Homo sapiens (Human))
Umr7200 Cnrs/Universit£
Curated by ChEMBL
LigandPNGBDBM50459395(CHEMBL4210158)
Affinity DataKi:  331nM. Assay description: Displacement of [3H]-AVP from human V2 receptor expressed in CHO cell membranes by radioligand binding assay
Ligand InfoPC cidPC sid
In DepthDetails ArticlePubMed
TargetOxytocin receptor(Homo sapiens (Human))
Umr7200 Cnrs/Universit£
Curated by ChEMBL
LigandPNGBDBM50459395(CHEMBL4210158)
Affinity DataKi: >1.00E+3nM. Assay description: Displacement of [3H]-AVP from human OXR receptor expressed in CHO cell membranes by radioligand binding assay
Ligand InfoPC cidPC sid
In DepthDetails ArticlePubMed