BDBM50459406 CHEMBL4213812
SMILES Ic1ccc(cc1)C(=O)N1CCCCc2ccccc12
InChI Key InChIKey=IFDJPSALQGUKIU-UHFFFAOYSA-N
Data  3 KI
  Tab Delimited (TSV)   2D SDfile   Computed 3D by Vconf -m prep SDfile
Find this compound or compounds like it in BindingDB:
Activity Spreadsheet -- Enzyme Inhibition Constant Data from BindingDB
Found 3 hits for monomerid = 50459406
TargetVasopressin V1a receptor(Homo sapiens (Human))
Umr7200 Cnrs/Universit£
Curated by ChEMBL
LigandPNGBDBM50459406(CHEMBL4213812)
Affinity DataKi:  48nM. Assay description: Displacement of [3H]-AVP from human V1A receptor expressed in CHO cell membranes by radioligand binding assay
Ligand InfoPC cidPC sid
In DepthDetails ArticlePubMed
TargetVasopressin V2 receptor(Homo sapiens (Human))
Umr7200 Cnrs/Universit£
Curated by ChEMBL
LigandPNGBDBM50459406(CHEMBL4213812)
Affinity DataKi:  160nM. Assay description: Displacement of [3H]-AVP from human V2 receptor expressed in CHO cell membranes by radioligand binding assay
Ligand InfoPC cidPC sid
In DepthDetails ArticlePubMed
TargetOxytocin receptor(Homo sapiens (Human))
Umr7200 Cnrs/Universit£
Curated by ChEMBL
LigandPNGBDBM50459406(CHEMBL4213812)
Affinity DataKi:  396nM. Assay description: Displacement of [3H]-AVP from human OXR receptor expressed in CHO cell membranes by radioligand binding assay
Ligand InfoPC cidPC sid
In DepthDetails ArticlePubMed