BDBM50459407 CHEMBL4204008
SMILES Cc1ccn(n1)-c1ccc(C(=O)N2CCCC(O)c3ccccc23)c(Cl)c1
InChI Key InChIKey=QSKJZSKXHAFOQI-UHFFFAOYSA-N
Data  3 KI
  Tab Delimited (TSV)   2D SDfile   Computed 3D by Vconf -m prep SDfile
Find this compound or compounds like it in BindingDB:
Activity Spreadsheet -- Enzyme Inhibition Constant Data from BindingDB
Found 3 hits for monomerid = 50459407
TargetVasopressin V1a receptor(Homo sapiens (Human))
Umr7200 Cnrs/Universit£
Curated by ChEMBL
LigandPNGBDBM50459407(CHEMBL4204008)
Affinity DataKi: <10nM. Assay description: Displacement of [3H]-AVP from human V1A receptor expressed in CHO cell membranes by radioligand binding assay
Ligand InfoPC cidPC sid
In DepthDetails ArticlePubMed
TargetVasopressin V2 receptor(Homo sapiens (Human))
Umr7200 Cnrs/Universit£
Curated by ChEMBL
LigandPNGBDBM50459407(CHEMBL4204008)
Affinity DataKi:  100nM. Assay description: Displacement of [3H]-AVP from human V2 receptor expressed in CHO cell membranes by radioligand binding assay
Ligand InfoPC cidPC sid
In DepthDetails ArticlePubMed
TargetOxytocin receptor(Homo sapiens (Human))
Umr7200 Cnrs/Universit£
Curated by ChEMBL
LigandPNGBDBM50459407(CHEMBL4204008)
Affinity DataKi:  800nM. Assay description: Displacement of [3H]-AVP from human OXR receptor expressed in CHO cell membranes by radioligand binding assay
Ligand InfoPC cidPC sid
In DepthDetails ArticlePubMed