BDBM50459856 CHEMBL4227113
SMILES Oc1ccc(cc1)C1=C(c2ccc(\C=C\C(=O)Nc3ccccc3)cc2)c2ccc(F)cc2OCC1
InChI Key InChIKey=NTJSBSWXCDFDAL-CAOOACKPSA-N
Data  2 IC50
  Tab Delimited (TSV)   2D SDfile   Computed 3D by Vconf -m prep SDfile
Find this compound or compounds like it in BindingDB:
Activity Spreadsheet -- Enzyme Inhibition Constant Data from BindingDB
Found 2 hits for monomerid = 50459856
TargetEstrogen receptor beta(Homo sapiens (Human))
Trinity College
Curated by ChEMBL
LigandPNGBDBM50459856(CHEMBL4227113)
Affinity DataIC50:  0.940nM. Assay description: Displacement of fluorescein-labeled estradiol (fluoromone) from human recombinant full-length estrogen receptor beta after 2 hrs by fluorescence pola...
Ligand InfoPC cidPC sid
In DepthDetails ArticlePubMed
TargetEstrogen receptor(Homo sapiens (Human))
Trinity College
Curated by ChEMBL
LigandPNGBDBM50459856(CHEMBL4227113)
Affinity DataIC50:  12nM. Assay description: Displacement of fluorescein-labeled estradiol (fluoromone) from human recombinant full-length estrogen receptor alpha after 2 hrs by fluorescence pol...
Ligand InfoPC cidPC sid
In DepthDetails ArticlePubMed