BDBM50460721 CHEMBL4225264
SMILES COc1ccccc1C(=O)c1sc(N)nc1-c1ccc(Cl)c(c1)C(F)(F)F
InChI Key InChIKey=WVCPRNBQSCQLOH-UHFFFAOYSA-N
Data  2 IC50
  Tab Delimited (TSV)   2D SDfile   Computed 3D by Vconf -m prep SDfile
Find this compound or compounds like it in BindingDB:
Activity Spreadsheet -- Enzyme Inhibition Constant Data from BindingDB
Found 2 hits for monomerid = 50460721
TargetNuclear receptor ROR-beta(Homo sapiens (Human))
The Scripps Research Institute
Curated by ChEMBL
LigandPNGBDBM50460721(CHEMBL4225264)
Affinity DataIC50:  160nM. Assay description: Displacement of [3H]-T0901317 from recombinant human His-SUMO-tagged RORbeta LBD (71 to 459 residues) expressed in Escherichia coli BL21(DE3) at afte...
Ligand InfoPC cidPC sid
In DepthDetails ArticlePubMed
TargetNuclear receptor ROR-gamma(Homo sapiens (Human))
The Scripps Research Institute
Curated by ChEMBL
LigandPNGBDBM50460721(CHEMBL4225264)
Affinity DataIC50: >4.00E+4nM. Assay description: Displacement of [3H]-T0901317 from recombinant human His-SUMO-tagged RORgamma LBD (265 to 518 residues) expressed in Escherichia coli BL21(DE3) at af...
Ligand InfoPC cidPC sid
In DepthDetails ArticlePubMed