BDBM50461062 CHEMBL4227197
SMILES CC(=O)Nc1cccc(c1)-c1ccc(s1)-c1ccccc1
InChI Key InChIKey=WSISOLKXKJZFLX-UHFFFAOYSA-N
Data  1 IC50
  Tab Delimited (TSV)   2D SDfile   Computed 3D by Vconf -m prep SDfile
Find this compound or compounds like it in BindingDB:
Activity Spreadsheet -- Enzyme Inhibition Constant Data from BindingDB
Found 1 hit for monomerid = 50461062
TargetRibosyldihydronicotinamide dehydrogenase [quinone](Homo sapiens (Human))
University Of Manchester
Curated by ChEMBL
LigandPNGBDBM50461062(CHEMBL4227197)
Affinity DataIC50:  2.00E+3nM. Assay description: Inhibition of recombinant human NQO2 assessed as change in rate of decolouration of DCPIP measured over 1 min by spectrophotometric method
Ligand InfoPC cidPC sid
In DepthDetails ArticlePubMed