BDBM50461132 CHEMBL4229241
SMILES NC(=O)c1cccc2C(NCc3c(F)cccc3C(F)(F)F)N=C(Nc12)N1Cc2c(N)n[nH]c2C11CC1
InChI Key InChIKey=XIRQEDLEBLDLHQ-UHFFFAOYSA-N
Data  1 IC50
  Tab Delimited (TSV)   2D SDfile   Computed 3D by Vconf -m prep SDfile
Find this compound or compounds like it in BindingDB:
Activity Spreadsheet -- Enzyme Inhibition Constant Data from BindingDB
Found 1 hit for monomerid = 50461132
TargetADP-ribosyl cyclase/cyclic ADP-ribose hydrolase 1(Homo sapiens (Human))
Glaxosmithkline Research And Development
Curated by ChEMBL
LigandPNGBDBM50461132(CHEMBL4229241)
Affinity DataIC50:  4nM. Assay description: Inhibition of recombinant human CD38 extracellular domain expressed in Pichia pastoris using NAD as substrate pretreated for 30 mins followed by subs...
Ligand InfoPC cidPC sid
In DepthDetails ArticlePubMed