BDBM50461483 CHEMBL4226891
SMILES Nc1nc2cc(cc(-c3ccc(cc3)C(O)=O)c2c(=O)n1C[C@@H]1CC[C@@H](O1)c1ccccc1)-c1ccccc1
InChI Key InChIKey=IBSOPQYKTQLOPF-LBNVMWSVSA-N
Data  4 IC50
  Tab Delimited (TSV)   2D SDfile   Computed 3D by Vconf -m prep SDfile
Find this compound or compounds like it in BindingDB:
Activity Spreadsheet -- Enzyme Inhibition Constant Data from BindingDB
Found 4 hits for monomerid = 50461483
TargetPlasmepsin IV [1-448](Plasmodium falciparum)
Latvian Institute Of Organic Synthesis
Curated by ChEMBL
LigandPNGBDBM50461483(CHEMBL4226891)
Affinity DataIC50:  500nM. Assay description: Inhibition of Plasmodium falciparum plasmepsin 4 using DABCYL-Glu-Arg-Nle-Phe-Leu-Ser-Phe-Pro-EDANS as substrate preincubated for 30 mins followed by...
Ligand InfoPC cidPC sid
In DepthDetails ArticlePubMed
TargetCathepsin D(Homo sapiens (Human))
Latvian Institute Of Organic Synthesis
Curated by ChEMBL
LigandPNGBDBM50461483(CHEMBL4226891)
Affinity DataIC50:  2.00E+4nM. Assay description: Inhibition of human cathepsin D using DABCYL-Glu-Arg-Nle-Phe-Leu-Ser-Phe-Pro-EDANS as substrate preincubated for 30 mins followed by substrate additi...
Ligand InfoPC cidPC sid
In DepthDetails ArticlePubMed
TargetPlasmepsin I(Plasmodium falciparum)
Latvian Institute Of Organic Synthesis
Curated by ChEMBL
LigandPNGBDBM50461483(CHEMBL4226891)
Affinity DataIC50:  600nM. Assay description: Inhibition of Plasmodium falciparum plasmepsin-1 using DABCYL-Glu-Arg-Nle-Phe-Leu-Ser-Phe-Pro-EDANS as substrate preincubated for 30 mins followed by...
Ligand InfoPC cidPC sid
In DepthDetails ArticlePubMed
TargetPlasmepsin II(Plasmodium falciparum)
Latvian Institute Of Organic Synthesis
Curated by ChEMBL
LigandPNGBDBM50461483(CHEMBL4226891)
Affinity DataIC50:  280nM. Assay description: Inhibition of Plasmodium falciparum plasmepsin-2 using DABCYL-Glu-Arg-Nle-Phe-Leu-Ser-Phe-Pro-EDANS as substrate preincubated for 30 mins followed by...
Ligand InfoPC cidPC sid
In DepthDetails ArticlePubMed