BDBM50463592 CHEMBL4245036
SMILES O=S(=O)(N1CCC(CC1)Nc1ccc(cn1)C#N)c1ccc(cc1)-c1ccccc1
InChI Key InChIKey=TXDUSJXSAZBDRF-UHFFFAOYSA-N
Data  5 IC50
  Tab Delimited (TSV)   2D SDfile   Computed 3D by Vconf -m prep SDfile
Find this compound or compounds like it in BindingDB:
Activity Spreadsheet -- Enzyme Inhibition Constant Data from BindingDB
Found 5 hits for monomerid = 50463592
TargetC-C chemokine receptor type 6(Macaca mulatta)
Takeda Pharmaceutical
Curated by ChEMBL
LigandPNGBDBM50463592(CHEMBL4245036)
Affinity DataIC50:  280nM. Assay description: Inhibition of monkey CCR6 expressed in CHO cells assessed as decrease in CCL20-induced reduction of forskolin-stimulated cAMP accumulation preincubat...
Ligand InfoPC cidPC sid
In DepthDetails ArticlePubMed
TargetC-C chemokine receptor type 6(Homo sapiens (Human))
Takeda Pharmaceutical
Curated by ChEMBL
LigandPNGBDBM50463592(CHEMBL4245036)
Affinity DataIC50:  240nM. Assay description: Inhibition of human CCR6 expressed in CHO cells assessed as decrease in human CCL20-dependent cell migration incubated for 4 hrs by Diff-Quik stainin...
Ligand InfoPC cidPC sid
In DepthDetails ArticlePubMed
TargetC-C chemokine receptor type 7(Homo sapiens (Human))
Takeda Pharmaceutical
Curated by ChEMBL
LigandPNGBDBM50463592(CHEMBL4245036)
Affinity DataIC50: >3.00E+4nM. Assay description: Inhibition of human CCR7 expressed in CHO cells assessed as decrease in CCL19-induced reduction of forskolin-stimulated cAMP accumulation preincubate...
Ligand InfoPC cidPC sid
In DepthDetails ArticlePubMed
TargetC-C chemokine receptor type 6(Homo sapiens (Human))
Takeda Pharmaceutical
Curated by ChEMBL
LigandPNGBDBM50463592(CHEMBL4245036)
Affinity DataIC50:  290nM. Assay description: Inhibition of human CCR6 expressed in CHO cells assessed as decrease in CCL20-induced reduction of forskolin-stimulated cAMP accumulation preincubate...
Ligand InfoPC cidPC sid
In DepthDetails ArticlePubMed
TargetC-C chemokine receptor type 1(Homo sapiens (Human))
Takeda Pharmaceutical
Curated by ChEMBL
LigandPNGBDBM50463592(CHEMBL4245036)
Affinity DataIC50: >3.00E+4nM. Assay description: Inhibition of human CCR1 expressed in CHO cells assessed as decrease in RANTES-induced reduction of forskolin-stimulated cAMP accumulation preincubat...
Ligand InfoPC cidPC sid
In DepthDetails ArticlePubMed