BDBM50465799 CHEMBL4285877
SMILES COc1ccccc1-n1nc(cc1-c1ccc(Cl)cc1)[C@@H]1CCO[C@H](C1)C(C)C
InChI Key InChIKey=VTJFSPOVFGEZFH-HOYKHHGWSA-N
Data  1 IC50
  Tab Delimited (TSV)   2D SDfile   Computed 3D by Vconf -m prep SDfile
Find this compound or compounds like it in BindingDB:
Activity Spreadsheet -- Enzyme Inhibition Constant Data from BindingDB
Found 1 hit for monomerid = 50465799
TargetVoltage-dependent N-type calcium channel subunit alpha-1B(Homo sapiens (Human))
Janssen Research & Development
Curated by ChEMBL
LigandPNGBDBM50465799(CHEMBL4285877)
Affinity DataIC50:  20nM. Assay description: Inhibition of Cav2.2 (unknown origin) expressed in HEK293 cells assessed as decrease in KCl depolarization-induced Ca2+ influx measured for 5 mins by...
Ligand InfoPC cidPC sid
In DepthDetails ArticlePubMed