BDBM50465803 CHEMBL4292404
SMILES CSCC[C@@H]1NC(=O)[C@H](CC(C)C)NC(=O)[C@H](CCCNC(N)=N)NC(=O)[C@H](CO)NC(=O)[C@@H]2CSSC[C@H](NC(=O)[C@H](CSSC[C@H](N)C(=O)N[C@@H](CCCCN)C(=O)NCC(=O)N[C@@H](CCCCN)C(=O)NCC(=O)N[C@@H](C)C(=O)N[C@@H](CCCCN)C(=O)N2)NC(=O)[C@H](CC(O)=O)NC(=O)[C@H](Cc2ccc(O)cc2)NC1=O)C(=O)N[C@@H]([C@@H](C)O)C(=O)NCC(=O)N[C@@H](CO)C(=O)N[C@H]1CSSC[C@H](NC(=O)[C@H](CCCCN)NC(=O)CNC(=O)[C@H](CO)NC(=O)[C@H](CCCNC(N)=N)NC1=O)C(N)=O
InChI Key InChIKey=ULONWJNFAHJILQ-QTBYCLKRSA-N
Data  3 IC50
  Tab Delimited (TSV)   2D SDfile   Computed 3D by Vconf -m prep SDfile
Find this compound or compounds like it in BindingDB:
Activity Spreadsheet -- Enzyme Inhibition Constant Data from BindingDB
Found 3 hits for monomerid = 50465803
TargetVoltage-dependent N-type calcium channel subunit alpha-1B(Homo sapiens (Human))
Janssen Research & Development
Curated by ChEMBL
LigandPNGBDBM50465803(CHEMBL4292404)
Affinity DataIC50:  49nM. Assay description: Inhibition of low frequency stimulation-induced Cav2.2 (unknown origin) expressed in HEK293 cells at -80 mV holding membrane potential by automated p...
Ligand InfoPC cidPC sid
In DepthDetails ArticlePubMed
TargetVoltage-dependent N-type calcium channel subunit alpha-1B(Homo sapiens (Human))
Janssen Research & Development
Curated by ChEMBL
LigandPNGBDBM50465803(CHEMBL4292404)
Affinity DataIC50:  48nM. Assay description: Inhibition of high frequency stimulation-induced Cav2.2 (unknown origin) expressed in HEK293 cells at -80 mV holding membrane potential by automated ...
Ligand InfoPC cidPC sid
In DepthDetails ArticlePubMed
TargetVoltage-dependent N-type calcium channel subunit alpha-1B(Homo sapiens (Human))
Janssen Research & Development
Curated by ChEMBL
LigandPNGBDBM50465803(CHEMBL4292404)
Affinity DataIC50:  22nM. Assay description: Inhibition of Cav2.2 (unknown origin) expressed in HEK293 cells assessed as decrease in KCl depolarization-induced Ca2+ influx measured for 5 mins by...
Ligand InfoPC cidPC sid
In DepthDetails ArticlePubMed