BDBM50466360 CHEMBL4289617
SMILES NS(=O)(=O)c1ccc(CCCC2Nc3ccc(cc3NC2=O)C(=O)N2CCN(CC2)c2ccncc2)cc1
InChI Key InChIKey=DEEPDCSUWZPGPP-UHFFFAOYSA-N
Data  4 IC50
  Tab Delimited (TSV)   2D SDfile   Computed 3D by Vconf -m prep SDfile
Find this compound or compounds like it in BindingDB:
Activity Spreadsheet -- Enzyme Inhibition Constant Data from BindingDB
Found 4 hits for monomerid = 50466360
TargetCD209 antigen(Homo sapiens (Human))
Massachusetts Institute Of Technology
Curated by ChEMBL
LigandPNGBDBM50466360(CHEMBL4289617)
Affinity DataIC50:  310nM. Assay description: Inhibition of DC-SIGN (unknown origin) after 1 hr by fluorescence analysis
Ligand InfoPC cidPC sid
In DepthDetails ArticlePubMed
LigandPNGBDBM50466360(CHEMBL4289617)
Affinity DataIC50:  310nM. Assay description: Inhibition of DC-SIGN extracellular domain (unknown origin) expressed in Escherichia coli DE3(BL21) incubated for 1 hrs in presence of Man-Fl-BSA by ...
Ligand InfoPC cidPC sid
In DepthDetails PubMed
LigandPNGBDBM50466360(CHEMBL4289617)
Affinity DataIC50:  300nM. Assay description: Inhibition of DC-SIGN (unknown origin) by high-throughput ELLA-type assay
Ligand InfoPC cidPC sid
In DepthDetails PubMed
LigandPNGBDBM50466360(CHEMBL4289617)
Affinity DataIC50:  310nM. Assay description: Inhibition of DC-SIGN (unknown origin)
Ligand InfoPC cidPC sid
In DepthDetails PubMed