BDBM50466604 CHEMBL4280206
SMILES [I-].C(CCCCC[P+](c1ccccc1)(c1ccccc1)c1ccccc1)CCCCOc1ccc(\C=C\c2ccccc2)cc1
InChI Key InChIKey=RNTYIICESKRMFD-QVIHXGFCSA-N
Data  2 KI
  Tab Delimited (TSV)   2D SDfile   Computed 3D by Vconf -m prep SDfile
Find this compound or compounds like it in BindingDB:
Activity Spreadsheet -- Enzyme Inhibition Constant Data from BindingDB
Found 2 hits for monomerid = 50466604
TargetNeuronal acetylcholine receptor subunit alpha-7(Homo sapiens (Human))
Universit£
Curated by ChEMBL
LigandPNGBDBM50466604(CHEMBL4280206)
Affinity DataKi:  1.93E+3nM. Assay description: Displacement of [125I]-alpha-bungarotoxin from human alpha7 nAChR expressed in human SH-SY5Y cell membranes after 30 mins by gamma counting analysis
Ligand InfoPC cidPC sid
In DepthDetails ArticlePubMed
TargetNeuronal acetylcholine receptor subunit alpha-4/beta-2(Homo sapiens (Human))
Universit£
Curated by ChEMBL
LigandPNGBDBM50466604(CHEMBL4280206)
Affinity DataKi: >3.00E+3nM. Assay description: Displacement of (+/-)-[3H]-epibatidine from human alpha4beta2 nAChR expressed in HEK293 cell membranes after 30 mins by beta counting analysis
Ligand InfoPC cidPC sid
In DepthDetails ArticlePubMed