BDBM50466612 CHEMBL4290427
SMILES [I-].C(CCCCOc1ccc(\C=C\c2ccccc2)cc1)CCCC[P+](c1ccccc1)(c1ccccc1)c1ccccc1
InChI Key InChIKey=NPCCVCGATKYNQM-ZQHSETAFSA-N
Data  1 KI
  Tab Delimited (TSV)   2D SDfile   Computed 3D by Vconf -m prep SDfile
Find this compound or compounds like it in BindingDB:
Activity Spreadsheet -- Enzyme Inhibition Constant Data from BindingDB
Found 1 hit for monomerid = 50466612
TargetNeuronal acetylcholine receptor subunit alpha-7(Homo sapiens (Human))
Universit£
Curated by ChEMBL
LigandPNGBDBM50466612(CHEMBL4290427)
Affinity DataKi:  1.29E+3nM. Assay description: Displacement of [125I]-alpha-bungarotoxin from human alpha7 nAChR expressed in human SH-SY5Y cell membranes after 30 mins by gamma counting analysis
Ligand InfoPC cidPC sid
In DepthDetails ArticlePubMed