BDBM50466616 CHEMBL4288118
SMILES [I-].C(COc1ccc(\C=C\c2ccccc2)cc1)C[P+](c1ccccc1)(c1ccccc1)c1ccccc1
InChI Key InChIKey=DUODXKMWAGJZAX-GHVJWSGMSA-N
Data  1 KI
  Tab Delimited (TSV)   2D SDfile   Computed 3D by Vconf -m prep SDfile
Find this compound or compounds like it in BindingDB:
Activity Spreadsheet -- Enzyme Inhibition Constant Data from BindingDB
Found 1 hit for monomerid = 50466616
TargetNeuronal acetylcholine receptor subunit alpha-7(Homo sapiens (Human))
Universit£
Curated by ChEMBL
LigandPNGBDBM50466616(CHEMBL4288118)
Affinity DataKi:  984nM. Assay description: Displacement of [125I]-alpha-bungarotoxin from human alpha7 nAChR expressed in human SH-SY5Y cell membranes after 30 mins by gamma counting analysis
Ligand InfoPC cidPC sid
In DepthDetails ArticlePubMed