BDBM50467696 CHEMBL4291408
SMILES CC(Cn1ncc2c(Nc3cc(O)ccc3Cl)nc(NCCN)nc12)c1ccccc1
InChI Key InChIKey=YPVYLNANXKPTGX-UHFFFAOYSA-N
Data  1 KI
  Tab Delimited (TSV)   2D SDfile   Computed 3D by Vconf -m prep SDfile
Find this compound or compounds like it in BindingDB:
Activity Spreadsheet -- Enzyme Inhibition Constant Data from BindingDB
Found 1 hit for monomerid = 50467696
TargetProto-oncogene tyrosine-protein kinase Src(Homo sapiens (Human))
Universit£
Curated by ChEMBL
LigandPNGBDBM50467696(CHEMBL4291408)
Affinity DataKi:  33nM. Assay description: Inhibition of human c-Src using KVEKIGEGTYGVVYK as substrate in presence of [gamma32P]ATP by scintillation counting method
Ligand InfoPC cidPC sid
In DepthDetails ArticlePubMed