BDBM50468728 CHEMBL4290479
SMILES CC(C)C[C@H](NC(=O)OC(C)(C)C)C(=O)N1CCC[C@@H]1C(=O)N1C(C1C(=O)OCCCc1ccccc1)C(O)=O
InChI Key InChIKey=JKYXBJCYJJXTPV-UMGBCHEESA-N
Data  1 KI
  Tab Delimited (TSV)   2D SDfile   Computed 3D by Vconf -m prep SDfile
Find this compound or compounds like it in BindingDB:
Activity Spreadsheet -- Enzyme Inhibition Constant Data from BindingDB
Found 1 hit for monomerid = 50468728
TargetFalcipain 2(Plasmodium falciparum)
Johannes Gutenberg-Universit£T Mainz
Curated by ChEMBL
LigandPNGBDBM50468728(CHEMBL4290479)
Affinity DataKi:  2.86E+4nM. Assay description: Inhibition of Plasmodium falciparum falcipain 2 using Z-Phe-Arg-AMC as substrate by fluorometric assay
Ligand InfoPC cidPC sid
In DepthDetails ArticlePubMed