BDBM50471136 CHEMBL33006
SMILES CCC(=O)NCCn1c(Br)cc2ccc(OC)cc12
InChI Key InChIKey=FAWBDXMORMETMR-UHFFFAOYSA-N
Data  1 KI  1 IC50
  Tab Delimited (TSV)   2D SDfile   Computed 3D by Vconf -m prep SDfile
Find this compound or compounds like it in BindingDB:
Activity Spreadsheet -- Enzyme Inhibition Constant Data from BindingDB
Found 2 hits for monomerid = 50471136
TargetMelatonin receptor type 1A/1B(Homo sapiens (Human))
Universit£
Curated by ChEMBL
LigandPNGBDBM50471136(CHEMBL33006)
Affinity DataKi:  0.0440nM. Assay description: Binding affinity against melatonin receptor in the quail optica tecta using 2-[125] iodomelatonin (100 pM) as labelled ligand
Ligand InfoPC cidPC sid
In DepthDetails ArticlePubMed
TargetMelatonin receptor type 1A/1B(Homo sapiens (Human))
Universit£
Curated by ChEMBL
LigandPNGBDBM50471136(CHEMBL33006)
Affinity DataIC50:  0.160nM. Assay description: Inhibitory activity against melatonin receptor in the quail optica tecta using 2-[125] iodomelatonin as labelled ligand
Ligand InfoPC cidPC sid
In DepthDetails ArticlePubMed