BDBM50471478 CHEMBL339719
SMILES COC(=O)c1cccc(c1)-c1ccoc1C1=CN2CCC1CC2
InChI Key InChIKey=ZZCCWXNFFGHRJX-UHFFFAOYSA-N
Data  3 KI
  Tab Delimited (TSV)   2D SDfile   Computed 3D by Vconf -m prep SDfile
Find this compound or compounds like it in BindingDB:
Activity Spreadsheet -- Enzyme Inhibition Constant Data from BindingDB
Found 3 hits for monomerid = 50471478
TargetMuscarinic acetylcholine receptor M1/M2/M3/M4/M5(Homo sapiens (Human))
Uppsala University
Curated by ChEMBL
LigandPNGBDBM50471478(CHEMBL339719)
Affinity DataKi:  0.800nM. Assay description: Ability of compound to displace (-)-[3H]3-Quinuclidinyl benzilate (-)-[3H]-QNB from Muscarinic acetylcholine receptors in the parotid gland from Guin...
Ligand InfoPC cidPC sid
In DepthDetails ArticlePubMed
TargetMuscarinic acetylcholine receptor M1/M2/M3/M4/M5(Homo sapiens (Human))
Uppsala University
Curated by ChEMBL
LigandPNGBDBM50471478(CHEMBL339719)
Affinity DataKi:  0.950nM. Assay description: Ability of compound to displace (-)-[3H]3-Quinuclidinyl benzilate (-)-[3H]-QNB from Muscarinic acetylcholine receptors in cerebral cortex from Guinea...
Ligand InfoPC cidPC sid
In DepthDetails ArticlePubMed
TargetMuscarinic acetylcholine receptor M1/M2/M3/M4/M5(Homo sapiens (Human))
Uppsala University
Curated by ChEMBL
LigandPNGBDBM50471478(CHEMBL339719)
Affinity DataKi:  2.20nM. Assay description: Ability of compound to displace (-)-[3H]3-Quinuclidinyl benzilate (-)-[3H]-QNB from Muscarinic acetylcholine receptors in the heart from Guinea Pig.
Ligand InfoPC cidPC sid
In DepthDetails ArticlePubMed