BDBM50471859 CHEMBL334387
SMILES CC[C@@H]1O[C@]2(CN3CCC2C3)CC1=O
InChI Key InChIKey=UCBMMZUQOWFFKQ-CSUXEGHOSA-N
Data  1 KI
  Tab Delimited (TSV)   2D SDfile   Computed 3D by Vconf -m prep SDfile
Find this compound or compounds like it in BindingDB:
Activity Spreadsheet -- Enzyme Inhibition Constant Data from BindingDB
Found 1 hit for monomerid = 50471859
TargetMuscarinic acetylcholine receptor M1/M2/M3/M4/M5(RAT)
Astra Arcus Usa
Curated by ChEMBL
LigandPNGBDBM50471859(CHEMBL334387)
Affinity DataKi:  0.400nM. Assay description: Binding affinity against Muscarinic acetylcholine receptor using [3H]-OXO-M as the radioligand.
Ligand InfoPC cidPC sid
In DepthDetails ArticlePubMed