BDBM50474115 CHEMBL418610
SMILES CC(C)C[C@@H](NC(=O)CNC(=O)CNC(=O)OCc1ccccc1)C(=O)NO
InChI Key InChIKey=SPHJNGSYONHROL-CQSZACIVSA-N
Data  1 KI
  Tab Delimited (TSV)   2D SDfile   Computed 3D by Vconf -m prep SDfile
Find this compound or compounds like it in BindingDB:
Activity Spreadsheet -- Enzyme Inhibition Constant Data from BindingDB
Found 1 hit for monomerid = 50474115
TargetThermolysin(Bacillus thermoproteolyticus)
University Of Marburg
Curated by ChEMBL
LigandPNGBDBM50474115(CHEMBL418610)
Affinity DataKi:  2.51E+5nM. Assay description: pKi value expresses binding affinity against thermolysin pKi = -logKi (where Ki is in mol/L)
Ligand InfoPC cidPC sid
In DepthDetails ArticlePubMed