BDBM50474741 CHEMBL355729
SMILES CCC1(CC)OC(=C(C1=O)c1ccc(cc1)C(F)(F)F)c1ccc(cc1)S(C)(=O)=O
InChI Key InChIKey=HQNNEEJQPNJQSS-UHFFFAOYSA-N
Data  2 IC50
  Tab Delimited (TSV)   2D SDfile   Computed 3D by Vconf -m prep SDfile
Find this compound or compounds like it in BindingDB:
Activity Spreadsheet -- Enzyme Inhibition Constant Data from BindingDB
Found 2 hits for monomerid = 50474741
TargetProstaglandin G/H synthase 1(Mus musculus)
Amorepacific R&D Center
Curated by ChEMBL
LigandPNGBDBM50474741(CHEMBL355729)
Affinity DataIC50:  6.84E+3nM. Assay description: In vitro inhibitory activity against prostaglandin G/H synthase 1 using mouse peritoneal macrophage method
Ligand InfoPC cidPC sid
In DepthDetails ArticlePubMed
TargetProstaglandin G/H synthase 2(Mus musculus (Mouse))
Amorepacific R&D Center
Curated by ChEMBL
LigandPNGBDBM50474741(CHEMBL355729)
Affinity DataIC50:  68.4nM. Assay description: In vitro inhibitory activity against prostaglandin G/H synthase 2 using mouse peritoneal macrophage method
Ligand InfoPC cidPC sid
In DepthDetails ArticlePubMed