BDBM50474743 CHEMBL353935
SMILES CC1(C)OC(=C(C1=O)c1cccc(F)c1)c1ccc(cc1F)S(N)(=O)=O
InChI Key InChIKey=NLQBZFIJESRFTO-UHFFFAOYSA-N
Data  2 IC50
  Tab Delimited (TSV)   2D SDfile   Computed 3D by Vconf -m prep SDfile
Find this compound or compounds like it in BindingDB:
Activity Spreadsheet -- Enzyme Inhibition Constant Data from BindingDB
Found 2 hits for monomerid = 50474743
TargetProstaglandin G/H synthase 2(Mus musculus (Mouse))
Amorepacific R&D Center
Curated by ChEMBL
LigandPNGBDBM50474743(CHEMBL353935)
Affinity DataIC50:  7.91nM. Assay description: In vitro inhibitory activity against prostaglandin G/H synthase 2 using mouse peritoneal macrophage method
Ligand InfoPC cidPC sid
In DepthDetails ArticlePubMed
TargetProstaglandin G/H synthase 1(Mus musculus)
Amorepacific R&D Center
Curated by ChEMBL
LigandPNGBDBM50474743(CHEMBL353935)
Affinity DataIC50:  2.63E+4nM. Assay description: In vitro inhibitory activity against prostaglandin G/H synthase 1 using mouse peritoneal macrophage method
Ligand InfoPC cidPC sid
In DepthDetails ArticlePubMed