BDBM50474770 CHEMBL353965
SMILES CC1(C)OC(=C(C1=O)c1cccc(c1)C(F)(F)F)c1ccc(cc1)S(N)(=O)=O
InChI Key InChIKey=ACKYQIDHUUNIJP-UHFFFAOYSA-N
Data  2 IC50
  Tab Delimited (TSV)   2D SDfile   Computed 3D by Vconf -m prep SDfile
Find this compound or compounds like it in BindingDB:
Activity Spreadsheet -- Enzyme Inhibition Constant Data from BindingDB
Found 2 hits for monomerid = 50474770
TargetProstaglandin G/H synthase 1(Mus musculus)
Amorepacific R&D Center
Curated by ChEMBL
LigandPNGBDBM50474770(CHEMBL353965)
Affinity DataIC50:  1.99E+3nM. Assay description: In vitro inhibitory activity against prostaglandin G/H synthase 1 using mouse peritoneal macrophage method
Ligand InfoPC cidPC sid
In DepthDetails ArticlePubMed
TargetProstaglandin G/H synthase 2(Mus musculus (Mouse))
Amorepacific R&D Center
Curated by ChEMBL
LigandPNGBDBM50474770(CHEMBL353965)
Affinity DataIC50:  26.7nM. Assay description: In vitro inhibitory activity against prostaglandin G/H synthase 2 using mouse peritoneal macrophage method
Ligand InfoPC cidPC sid
In DepthDetails ArticlePubMed