BDBM50474771 CHEMBL352602
SMILES CC1(C)OC(=C(C1=O)c1cc(F)cc(F)c1)c1ccc(c(F)c1)S(N)(=O)=O
InChI Key InChIKey=NNYHVPCOAIUGBT-UHFFFAOYSA-N
Data  2 IC50
  Tab Delimited (TSV)   2D SDfile   Computed 3D by Vconf -m prep SDfile
Find this compound or compounds like it in BindingDB:
Activity Spreadsheet -- Enzyme Inhibition Constant Data from BindingDB
Found 2 hits for monomerid = 50474771
TargetProstaglandin G/H synthase 2(Mus musculus (Mouse))
Amorepacific R&D Center
Curated by ChEMBL
LigandPNGBDBM50474771(CHEMBL352602)
Affinity DataIC50:  50.3nM. Assay description: In vitro inhibitory activity against prostaglandin G/H synthase 2 using mouse peritoneal macrophage method
Ligand InfoPC cidPC sid
In DepthDetails ArticlePubMed
TargetProstaglandin G/H synthase 1(Mus musculus)
Amorepacific R&D Center
Curated by ChEMBL
LigandPNGBDBM50474771(CHEMBL352602)
Affinity DataIC50:  2.51E+5nM. Assay description: In vitro inhibitory activity against prostaglandin G/H synthase 1 using mouse peritoneal macrophage method
Ligand InfoPC cidPC sid
In DepthDetails ArticlePubMed