BDBM50474993 CHEMBL361996
SMILES O=C1NC(=O)C(=C1c1cn2CCNCc3cccc1c23)c1cccc2ccoc12
InChI Key InChIKey=KQPIZIMTVIHVTG-UHFFFAOYSA-N
Data  1 IC50
  Tab Delimited (TSV)   2D SDfile   Computed 3D by Vconf -m prep SDfile
Find this compound or compounds like it in BindingDB:
Activity Spreadsheet -- Enzyme Inhibition Constant Data from BindingDB
Found 1 hit for monomerid = 50474993
TargetGlycogen synthase kinase-3(Homo sapiens (Human))
Lilly Research Laboratories
Curated by ChEMBL
LigandPNGBDBM50474993(CHEMBL361996)
Affinity DataIC50:  3.40nM. Assay description: Inhibitory concentration against the Glycogen synthase kinase-3
Ligand InfoPC cidPC sid
In DepthDetails ArticlePubMed