BDBM50475011 CHEMBL178850
SMILES CN(C)C(=O)N1CCn2cc(C3=C(C(=O)NC3=O)c3cccc4ccoc34)c3cccc(C1)c23
InChI Key InChIKey=XVPJMVOASKOHIR-UHFFFAOYSA-N
Data  1 IC50
  Tab Delimited (TSV)   2D SDfile   Computed 3D by Vconf -m prep SDfile
Find this compound or compounds like it in BindingDB:
Activity Spreadsheet -- Enzyme Inhibition Constant Data from BindingDB
Found 1 hit for monomerid = 50475011
TargetGlycogen synthase kinase-3(Homo sapiens (Human))
Lilly Research Laboratories
Curated by ChEMBL
LigandPNGBDBM50475011(CHEMBL178850)
Affinity DataIC50:  2.70nM. Assay description: Inhibitory concentration against the Glycogen synthase kinase-3
Ligand InfoPC cidPC sid
In DepthDetails ArticlePubMed